Yarn Run Error Command Failed With Exit Code 1






*) ^& IF %ERRORLEVEL% LEQ 1 exit 0. 0\VC\BIN\x86_amd64\cl. I won’t expand as in memoryOverhead issue in Spark , but I would like one to have this in mind: Cores, Memory and MemoryOverhead are three things that. Lines 6-10 are the second stage for the build. On the Edit menu, point to New, and then you have to click on DWORD Value. If a container is no longer running, use the following command to find the status of the container: This article explains possible reasons for the following exit code: With exit code 137, you might also notice a status of Shutdown or the following failed message: The "task: non-zero exit (137)" message is effectively the result of a kill -9. ) So, read / parse stdout and stderr to find out what the problems are. A bash script is like a movie theater, there are different exists. If you're a DatHost customer you can find the console in the control panel by clicking on the "Console" button, as shown in the picture below: If you're not a DatHost customer, you should write these commands in the server console. 10) When it finishes, save it, exit notepad or wordpad, and return to the Command Prompt. Container exited with a non-zero exit code 7. Developer Community for Visual Studio Product family. Exit status codes apply to all containers in YARN. Build Phases [CP] Embed Pods Frameworks. I don't need it yet so I have deleted it completely and all works. If it's part of a custom OS image, add a Run Command Line task between the Apply Operating System and Setup Windows and ConfigMgr tasks. However, the shepherd might not be able to run a job successfully. ツアーAD カーボン 中古ゴルフクラブ Second Hand。中古 Cランク (フレックスS) ブリヂストン BRIDGESTONE J715 B3 9. Stack Overflow for Teams is a private, secure spot for you and your coworkers to find and share information. This problem can also occur in wireless connections, where the traffic isn't routed properly by OpenVPN. なんか失敗するねんけど。nodejsは初めてさわるので何もわからん。 (nodejs) D:\GitUnity\toio\0000\0020\toio. This is the purpose of the Input anchor on the Run Command tool along with the "Write Source" option. 2018-11-27 22:13:35,919 WARN privileged. This behavior is evident in the output of Example 3 below. The CLI process may exit with the following codes: 0: Linting succeeded without errors (warnings may have occurred) 1: An invalid command line argument or combination thereof was used; 2: Linting failed with one or more rule violations with severity error; Usage. 11 kB 0 [emitted] main [0]. That's why your [ $? -eq 0 ] test always succeeds. Exit Code Generator interface and return exit code from its getExitCode method. You can also specify an exit code in order to indicate to other programs that or how your script failed, e. def _get_cmd_output(cmd, delim, expected_len): ''' Verify if command exists and return output ''' if not any(os. 2 while start first created VM - TASK ERROR: start failed: command '/usr/bin/kvm -id 102 -chardev Search Everywhere Threads This forum This thread. Explanation. net # email: [email protected] Exit status 1 npm ERR! prepareGitDep npm ERR! npm ERR! prepareGitDep npm ERR! Failed at the [email protected] log shows "Script for Package:[site]00042, Program: Banner Shortcut Script failed with exit code 1. js>yarn build yarn run v1. This site uses cookies for analytics, personalized content and ads. For example, one or more files were locked by some other application, so they were not compressed. Because of this and other minor gotchas I recommend editing the package. INVALID_COMMAND_PROVIDED. child_process. It works fine until the yarn setup which failed with this error: npm ERR! code ELIFECYCLE npm ERR! errno 1 npm ERR! [email protected] Exit code: 1 Unable to parse command line. Q&A for Work. 1626 ERROR_FUNCTION_NOT_CALLED The function could not be executed. A different way to achieve the same result as above. 2 Webpage for YARN ResourceManager www. Registered User. You would have to refer to the application code for the meaning of exit code 3. nodemanager. 23 (master) Frappe Framework: v10. Job for nfs-server. Oh, it boots everything as long as it's a compress ELF executable named /vmlinux. I don't need it yet so I have deleted it completely and all works. In this stage, you copy all source code to the container and execute yarn run build that creates an optimized production build. Click Win key + R, type inetcpl. Would you mind to. and verify that the answers are correct. CLICK HERE to read about new FTP features in C-Kermit 8. js beased front-end for our application we got into the following issue:. How to conditionally do something if a command succeeded or failed. Failed to run patch request for instance: (exit code: -2068709375) : Single Node Cluster Patching !! Single Node Cluster Patching Today we got one patching for single cluster node and as usual it failed. Code Meaning; 0 No error: 1 Warning (Non fatal error(s)). 140 silver badges. Since Ant 1. Yes, as above - the first run I got the git "who are you" warning, so I ran the git configs and re-ran the updates. This usually occurs in only two cases: either the package never has been built before, or its previous build failed (returned a non-zero exit code). Excluding it from installation. 10) Disable anti-virus, retry installation: Install failed 11) Run command manually: Install failed. Thanks in advance. The purpose of command || true is to prevent set -e from exiting the script if command returns a non-zero exit code. 10]) by csc-sun. Apache Oozie is a workflow scheduler that is used to manage Apache Hadoop jobs. There were no errors thrown by either the CLI or by the service the request was made to. Stack Overflow for Teams is a private, secure spot for you and your coworkers to find and share information. Code Meaning; 0 No error: 1 Warning (Non fatal error(s)). 2 Putting It All Together if. js 12:16:51 client. Q&A for Work. i have the same problem and its a big one , i`v had a lot of shouting with windows and talked to my laptop provider and they all know about the code 65535 and i`v done all the same things that you all have tried and even whiped my hard drive and started all downloads again with the same problem happening. js 371 bytes {0} [built] [1]. Type the following command, and press Enter: accesschk. status or configuration and not directly with an internal failure of the command-line being run; they are essentially external to. execmgr 8/27/2014 3:17:54 PM 5572 (0x15C4) 2 Comments [ + ] Show comments. These codes are transparent to users executing CLP functions from the command line, but they can be retrieved when those functions are executed from a shell script. NoClassDefFoundError: org/apache/hadoop/service/CompositeService. JobRunner --master yarn --deploy-mode cluster --driver-memory=2g --executor-memory 2g --executor-cores 1 --num-executors 1. yarnclean file. "findstr" simply didn't find a match for the regexp. org/licenses/by-sa/2. I created a ReactApp, the project appears to be created. However, ‘excel’ command does not work from command prompt. I cannot run npm install or npm start. com/feeds/tag/yarn http://www. C:\Users\=====\WebstormProjects\dummy>yarn start yarn run v1. Transfer failed. This is the purpose of the Input anchor on the Run Command tool along with the "Write Source" option. @@[email protected]@@1: 2045: The command line you used to start Microsoft Office Access contains an option that Microsoft Office Access doesn't recognize. The package will only exist if you have first installed a "SAPGUI Installation Server" and then defined such a package on it, and the definition for the package is the xml file that is missing. main : command provided 1 main : user is abc main : requested yarn user is abc Container exited with a non-zero exit code 1 Looks like the exit code from the linux container executor. A trap is a snippet of code that the shell executes when it exits or receives a signal. Yarn guarantees that an install that works now will continue to work the same way in the future. bin symlinks, but we patch that behavior when you run yarn kbn bootstrap. However, if a command has 5 invocations, 4 Agent on all specified or targeted instances and returned an exit code. exe”‘ failed with exit status 2 C:\Program Files\Python27\include\Modules> Is there any suggestion for this?. You would place the commands above into a text file that lives on a network share somewhere. 如下图,求大神解决,试过使用npm install 去安装,然后发 现有些自己写的代码,自己电脑运行会有bug,在同事那倒不会出现,现在尝试统一使用yarn install 但是一直无法安装,求大神解决. Code Meaning; 0 No error: 1 Warning (Non fatal error(s)). View Public Profile for glamo_2312. If cache size is the issue, consider rebuilding the. Fear not, the guide above uses less than 90 characters of typing to install and turn on the GUI. To turn on Git debug logging, before pushing using the command line, proceed like this for different OS:. The yarn cache dir is usually separate to the npm/nvm dirs so even though you installed a fresh version of node you may still have had a corrupted package in the cache. On the Edit menu, point to New, and then you have to click on DWORD Value. The container-executor does not recognize the command it was asked to run. Qiita is a technical knowledge sharing and collaboration platform for programmers. Jumping to EOF in this way will exit your current script with the return code of 1. View Public Profile for glamo_2312. 👍 36 👎 4 🎉 6. Check the external tool's documentation to verify of course. Find all posts by glamo_2312. js>yarn build yarn run v1. It does not have any predefined meaning, but it's customary to return 0 to indicate "success", "not errors", anything else in all other cases which are totally application-dependent. SparkException: Yarn application already ended,might be killed or not able to. $ yarn run build yarn run v1. You can, however, include a conditional statement to exit the script if any command before the final one fails. However, both commands above will terminate a script after. 回复数 3 只看. Before we continue, let's explain what's happening in this Dockerfile. Destination filename specified with wild cards in the source. TechNet suggests this one-liner to convert the exit code into a more traditional exit code: (robocopy c:\dirA c:\dirB *. error: command ‘”C:\Program Files (x86)\Microsoft Visual Studio 12. I've tried this with two separate projects (one being brand new for testing) and I get linker command failed with exit code 1 (use -v to see invocation) for both. The only thing command && true does is run true (return a zero exit code) if `command succeeded (returned a zero exit code) - it's a complete no-op. I was able to code and run word-count problem in cluster mode by below command. These codes are transparent to users executing CLP functions from the command line, but they can be retrieved when those functions are executed from a shell script. OpenVPN Terminated with Exit Code 1 Windows This is a common error message that will cause your OpenVPN client to not connect to the internet. SETUID_OPER_FAILED. tex? – Werner Jun 22 '16 at 20:51 I'm not sure what you mean @Werner but I'll post what happens when I try to typeset sweavetut. Since it always returns true, it's used here to suppress the exit code of a failed cp (should that be desired). Observe it errors during the Tests phase and so doesn't launch properly on the device. I went the composer route as suggested on the theme documentation. To open a specific excel sheet from Run window you can use the below command. npm ERR! If you do, this is most likely a problem with the chromedriver package, npm ERR! not with npm. info "[email protected] Program terminated with exit code <1> Posted on Aug 08, 2016 at 04:08 AM | 1. The container-executor does not recognize the command it was asked to run. Wildcards in the destination. I am trying to execute a sqoop command to import data. Need access to an account? If your company has an existing Red Hat account, your organization administrator can grant you access. Thanks for answering @villeristi, unfortinately it's not work but when yarn fetch the packages, it give me those warnings ( fsevents compatible only with Mac OS, May be the problem is there ) : warning [email protected] I was able to code and run word-count problem in cluster mode by below command. Close the Cygwin shell. To repair damaged system, you have to purchase the licensed version of Reimage. info 29 30 Chapter 2 Apache Hadoop YARN Install Quick Start Run Sample MapReduce Examples To test your installation, run the sample “pi” program that calculates the value of pi. 0 client except under experimental conditions. Exit status is an integer number. Paused until further notice. , in the documentation only one script command is mentioned rather than the multiple used in that build. This topic describes User State Migration Tool (USMT) 10. exe files using the code shown below i just need to replace command=filename but i want to implement IF statement in. Adding the following lines will allow us to print out a nice. INVALID_COMMAND_PROVIDED. A non-zero (1-255) exit status indicates failure. 0 (TID 461, gsta32512. 5° Tour AD MJ-6 S 男性用 右利き ドライバー DR ツアーAD カーボン 中古ゴルフクラブ Second Hand. Thank you both for your help! I needed to apply a quick fix to get this working and I created a package with the "exit /b 0" at the end. The exit status is immediately returned to the status variable. SomeCommand. creativecommons. In cluster mode the driver runs inside the same container as the Application Master which makes a difference. We need to use start to open excel application from command line. None of the “–fix” commands were working for me so I just did it manually. In the generated extension, you can use npm run test or yarn test to run the integration tests that: Downloads and unzips latest version of VS Code. Indicates that command, application name or path has been misspelled when configuring the Action—Run DOS or CMD command or Start program or application. This topic describes User State Migration Tool (USMT) 10. For each of the font packages, if they are marked Keep, then select Reinstall, otherwise leave them as they are: Allow Cygwin's setup program to download and reinstall the fonts packages. Notice that it first sets the program status to FailureRetry and then WaitingRetry after the failure and that it actually tracks how many times the program has failed. First, install all dependencies. node-gyp folder and then the ~/. gz on a PC-style partitioned disk with an ext2 filesystem (must be revision 0!) on it's first partition or it uploaded with cu(1)'s send file command at 115200bps, 8N1. Exit Code-123: Cannot open std_err_file. 👍 36 👎 4 🎉 6. Thanks in advance. exe files using the code shown below i just need to replace command=filename but i want to implement IF statement in. Without looking at the details what the script does, a script can be directly run inside a terminal with the option -e (--command), without starting a shell - it is used instead of the shell then: gnome-terminal -e. I am NOT using a BSP, instead I am using my own custom hardwarefor a Kintex7 KC105 Evaluation kit. Stack Overflow for Teams is a private, secure spot for you and your coworkers to find and share information. Find solutions to the following Adobe Creative Cloud installation log error: "Exit Code: 14 - Failed due to insufficient privileges". I am new to sage 9 and am using it for the first time. To fix the problem: 1. wordpress Wordpress Roots Sage 9 translations. 탈모약(핀페시아) 138일차. You can use the high-level Spark APIs in Java, Scala, Python, and R to develop Spark applications in the big data platform, and then use Oozie to schedule Spark jobs. With Bash scripts, if the exit code is not specified in the script itself the exit code used will be the exit code of the last command run. Fast: Yarn caches every package it has downloaded, so it never needs to download the same package again. Privileged Execution Operation Output: main : command provided 1 main : run as user is hdp main : requested yarn user is hdp Getting exit code file Creating script. 586: INFO: Cleaning up. The EXIT statement will stop the process and set the exitcode to whatever is specified. info [email protected] A workaround to detect a non zero Exit Code from RD is to use conditional execution to run a command if the RD fails, the second command can be anything, but typically will be an Echo, Goto or CALL statement: RD NonExistentFolder || Echo This failed!. YARN: AM Container exited with exitCode: 1 Application application_1523897345683_2170 failed 2 container_e13_1523897345683_2170_04_000001 Exit code: 1. Reinstall your Adobe application. 1 $ jasmine Randomized with seed 11534 Started. Find solutions to the following Adobe Creative Cloud installation log error: "Exit Code: 14 - Failed due to insufficient privileges". How to get the exit code of a command. $ yarn add yarn |> to actually update yarn as it was 1. 2 to 3,3, my KVM guests ceased to boot. #!/bin/bash touch /root/ test echo created file. On the Edit menu, point to New, and then you have to click on DWORD Value. Developer Community for Visual Studio Product family. Are you able to connect the machine that you're building Kibana from to the internet so it's able to connect to S3?. 0(node:1818) [DEP0005] DeprecationWarning: Buffer() is deprecated due to security and usability issues. Syncml: The requested command failed but the recipient understood the requested command. Hi SCCM folks. If you're a DatHost customer you can find the console in the control panel by clicking on the "Console" button, as shown in the picture below: If you're not a DatHost customer, you should write these commands in the server console. Description. i have a problem with starting yarn in my react app Profile image Ahmed Gamal M 2 months ago i'm trying to create react app i installed nodejs, npm and yarn and i write this on my powershell : "create-react-app my-app" then "cd my-app" and all of this work perfect but when i wrote "yarn start " it's appear this " yarn run v1. In total this took me only a few minutes to do the run-through. I am NOT using a BSP, instead I am using my own custom hardwarefor a Kintex7 KC105 Evaluation kit. Please note that out of range exit values can result in unexpected exit codes (e. I want to learn UI development and create my own custom UI, vizualizations in Kibana. jar Exception on Windows: Exception in thread "main" org. Welcome to LinuxQuestions. storyboard is messed up? Clicking it instantly crashes xcode, creating new storyboard and clicking it instantly crashes xcode. Cause: A problem was encountered while running a job of type EXECUTABLE. This returns success (exit code 0) when the system is fully up and running, specifically not in startup, shutdown or maintenance mode, and with no failed services. The shell builtin true could be used instead and would be more readable. By continuing to browse this site, you agree to this use. I cannot run npm install or npm start. We also pass a specific non-zero return code from the failed command to inform the caller of our script about the failure. It provides scripts to build and run the application. environ['PATH']. The exec type provides a simple way to run those commands via puppet (on the puppet client, not the master) and harness them in your modelling, whether as a dependency of another resource, an easy way to accomplish something puppet doesn't yet provide or as part of a. 2 Putting It All Together if. EXE, it will detect the executable's Return or Exit Code and set the ERRORLEVEL to match. use_native_modules! Run the following command: pod repo update How to update React Native SDK to the latest version. Systems Manager Run Command reports detailed status information about the different states a command experiences during processing and for each instance that processed the command. Container has finished succesfully. Would you mind to. info "[email protected] Executing command line: Run command line with options (0, 4) InstallSoftware 12. The yarn cache dir is usually separate to the npm/nvm dirs so even though you installed a fresh version of node you may still have had a corrupted package in the cache. Error:error: linker command failed with exit code 1 (use -v to see invocation) 02-14 1万+ IOS中linker command failed with exit code 1 问题原因,如何调试?. By joining our community you will have the ability to post topics, receive our newsletter, use the advanced search, subscribe to threads and access many other special features. Defined codes are (some may not occur yet): 00 - successful 01 - at least 1 file tranferred, but at least one was not (not implemented yet) 02 - file not found 03 - file already exists 04 - file skipped 05 - cancelled by user 06 - cancelled by host (not implemented yet) 07 - transfer failed (started ok, but then failed for some reason) 08. Stack Overflow for Teams is a private, secure spot for you and your coworkers to find and share information. I am using Petalinux 2019. I am trying to run my nightwatch tests on Mac OS. The passed NodeManager root does not match the configured NodeManager root (yarn. 0 client except under experimental conditions. [14:11:25] warning You are using Node "7. The 'SHELL' command is used in Qbasic to issue a command to Command Prompt/Windows Shell. Hammer editor Run Map dialog. 435: Wolsey: Still in thy right hand carry gentle peace / To silence envious tongues. When I try npm install I get the following error: > [email protected] Stack Overflow for Teams is a private, secure spot for you and your coworkers to find and share information. Pinal Dave is a SQL Server Performance Tuning Expert and an independent consultant. 0(node:1818) [DEP0005] DeprecationWarning: Buffer() is deprecated due to security and usability issues. #e2fsck -y /dev/sda2; Run this command to remount the file system: mount -n -o remount,rw / Press CTRL+D to exit maintenance mode and complete the starting process. COMMAND COMMAND_OPTIONS: Various commands with their options are described in the following sections. Hi, I'm following this tutorial page https://duniter. According to the above table, exit codes 1 - 2, 126 - 165, and 255 have special meanings, and should therefore be avoided for user-specified exit parameters. 1 2 3 4 5 6 7 8 9 10 11 12 $ yarn test yarn run v1. [ERROR] An error occurred while running cordova build android (exit code 1): ANDROID_HOME=C:\Users\XYZ. Please note that out of range exit values can result in unexpected exit codes (e. -getServiceState Returns the state of the service. Checks whether the system is operational. guys, it is solved, but thats something i will file again under technological harrassment. So, does this mean that I should always run the way you suggested or it should work with my previous command yarn run dev as well ? Jack_Tauson_Sr May 2, 2019, 1:13pm #18. What I Wanted to Do > npm run-script build What Happened Instead /usr/src//setup # npm run-script build > [email protected] Being new to Yarn at this stage, I had accidentally created the. You would place the commands above into a text file that lives on a network share somewhere. The command in the batch file when run from the command line works perfectly and unzips the file, so there is absolutely no problem with the command, I believe it is just the set up of the. Hola @Milu, Qué buen tema para comenzar a tratar en nuestra comunidad! Es una excelente iniciativa comenzar a utilizar el stack con yarn, jest y eslint porque son piezas fundamentales del dia a día de un desarrollador, ya que nos permiten manejar estándares de codificación en nuestros equipos de trabajos. Also, this guide assumed one has a command line only installation. Developer Community for Visual Studio Product family. 2 xcode 是 4. clang: error: linker command failed with exit code 1 (use -v to see invocation) 0 2016-03-18 09:03:12. Reboot your server and rerun npm install in your project folder. It is another method to get rid of DISM failed errors. Apache Oozie is a workflow scheduler that is used to manage Apache Hadoop jobs. "Exit code: 1" when running "yarn install" for BitBucket repo Stefan Monov Oct 11, 2017 I had a public github repo in the `dependencies` section of my `package. 0 build: ember build npm ERR! Exit status 1 npm ERR! Failed at the [email protected] 0x2331 · 2331. 0 is not already installed then follow the post Build, Install, Configure and Run Apache Hadoop 2. When I ran yarn install first, it created the node_modules folder and after that the command yarn run dev ran fine. You need to use a particular shell variable. 29-Feb-2000 19:42:52-GMT,2692;000000000001 Return-Path: Received: from tug. 4) is not as easy and standard as it was in previous versions…. json file directly rather than using yarn add. Enter the command and package_name with the name of the software that is causing the problem: sudo apt-get remove ––purge package_name The ––purge option directs the system to remove config files in addition to uninstalling. Return Codes. exe Windows cannot access the specified device, path or file. March 24, 2019 September 16, 2019 exit code 127, yarn, yarn start The issue When we started react. 0:8032 15/05/14 13:00:51 INFO yarn. The -f option means fix-broken. dtsx) on my local instance, and completes successfully. Command failed to execute EPM Automate uses this exit code to display messages related to HTTP status code 200 and 400. Description. In either case, I'd suggest using at least exit 1, to indicate that the script failed. I have got Sqoop 1. 0 did not define any 1xx status codes, servers MUST NOT send a 1xx response to an HTTP/1. # 3 = Source ISO(s) have unrecognized mds5 sums. You are currently viewing LQ as a guest. These can be used within a shell script to change the flow of execution. exe with the proper -applaunch specified (see Steam section below). 1 | > [email protected] Q&A for Work. 172 bronze badges. tex? – Werner Jun 22 '16 at 20:51 I'm not sure what you mean @Werner but I'll post what happens when I try to typeset sweavetut. I ran yarn, yarn clean, yarn build, yarn run build- and on any build task I get: yarn run. Exit status is an integer number. gradle file contains the code. Locate and then click the following registry subkey: HKEY_LOCAL_MACHINE\SOFTWARE\Policies\Microsoft\System. 1 | ‘NODE_ENV’ is not recognized as an internal or external command, Your problem is windows based. 0 Time: 341ms Asset Size Chunks Chunk Names index. com # # This program is released under the GPL v2+ # # Return Codes # 0 = Successful run # 1 = Source ISO(s) not found # 2 = Source(es( not mounted and 'isoinfo' and/or 'iso-read' not installed. x Class Documentation phpagi-1. When a batch script. 4) is not as easy and standard as it was in previous versions…. 1: The last test results include warnings but no errors. yarnclean to do with. description and source-code default = function (message) { return { useless: true, run() { throw new. TechNet suggests this one-liner to convert the exit code into a more traditional exit code: (robocopy c:\dirA c:\dirB *. When I run npm start or yarn start see below for the errors. Some of these conditions can be differentiated by examining the specific exit code of the command instead of acting on all nonzero exit codes. io/:my-tag Caused by Container for step title: Building Docker Image, step type: build, operation: Building image failed with exit code: 137. apply plugin : ‘application’ // In this section you declare where to find the dependencies of. You can record and post programming tips, know-how and notes here. node-gyp folder and then the ~/. The good news is that can be accomplished with only the Run Command tool itself. We also pass a specific non-zero return code from the failed command to inform the caller of our script about the failure. 2 Fatal error: 7 Command line error: 8 Not enough memory for operation: 255 User stopped the process. Registered User. ( No browsers open etc). Every Linux or Unix command executed by the shell script or user has an exit status. Fast: Yarn caches every package it has downloaded, so it never needs to download the same package again. 问题: 导入某个类文件出现: ld: × duplicate symbol for architecture ××× clang: error: linker command failed with exit code 1 (use -v to see invocation) 用的是Mac OSX 10. 0 (node:1818) [DEP0005] DeprecationWarning: Buffer() is deprecated due to security and usability issues. Yes, as above - the first run I got the git "who are you" warning, so I ran the git configs and re-ran the updates. 15/04/07 12:23:12 INFO mapred. Command-line batch script files launching these applications. when I want to start development server with yarn start throw an error unhand-led 'error' event and. Since HTTP/1. INVALID_NM_ROOT. Other numbers can be used, but these are treated modulo 256, so exit -10 is equivalent to exit 246, and exit 257 is equivalent to exit 1. There is likely additional logging output above. 0x2331 · 2331. When you ran yarn add --dev yarn destroys the patch that we add, so you have to run yarn kbn bootstrap again to patch the bin scripts. 1 install script node install. 008 seconds Randomized with. 11 kB 0 [emitted] main [0]. Scanning 557 folders for symlinks in C:UsersdipAwesomeProjectnode_mo ules (31ms) JS server already running. FTP SCRIPT : FTP AUTOMATION : AUTOMATE FTP : BATCH FTP : PROGRAMMABLE FTP : UNATTENDED FTP This page is written for users of Unix operating systems -- Linux, Mac OS X, FreeBSD, AIX, HP-UX, IRIX, Solaris, etc. Excuse the verbose log, but if you scroll down you will see an exit code of 1. First, the Output Data tool above your Run Command appears to be duplicating some efforts. Systems Manager Run Command reports detailed status information about the different states a command experiences during processing and for each instance that processed the command. Hi, I'm following this tutorial page https://duniter. After this, all live data is in one. ☁ vue-admin-template [master] ⚡ yarn run lint yarn run v1. On Mac OS X, if you would rather not open a terminal and use the command line, a GUI front-end for traceroute (and several other utilities) called Network Utility can be found in the Utilities folder within the Applications folder. Creative Cloud applications store information about the installation and launch process in log files. When I run the steps below, nothing changes. you can use env 1>/tmp/envars. 3 and the following Apache patches: HADOOP-1023: Add more logging in WASB page blob read function. On Windows: spark-submit --class org. Command Task Failed with exit code 9 venkatsai Jun 25, 2013 9:09 AM ( in response to user189660 ) Please let me know the exactly what you are added in custom properties,because I am also facing similar issue. When a batch script. For instance its exited at x time and minutes, after 10-15 minutes it will be back again. The container-executor does not recognize the command it was asked to run. storyboard is messed up? Clicking it instantly crashes xcode, creating new storyboard and clicking it instantly crashes xcode. Here are the definitive list of USMT 5 return codes, based on the table provided I could see that USMT return code 3 = USMT_WOULD_HAVE_FAILED which meant that I had to review the loadstate. 2\examples\target\scala-2. If it gives an error, you need to add the path to FSI to the system variables like this: If it gives an error, you need to add the path to FSI to the system variables like this:. 15/04/07 12:23:12 INFO mapred. When you use the /Package= command-line switch, the installer will look for a defined 'package' using the name you specify (in your case, 'sapgui750'). However, both commands above will terminate a script after. 0 (Ubuntu 14. With Bash scripts, if the exit code is not specified in the script itself the exit code used will be the exit code of the last command run. We also pass a specific non-zero return code from the failed command to inform the caller of our script about the failure. The exec type provides a simple way to run those commands via puppet (on the puppet client, not the master) and harness them in your modelling, whether as a dependency of another resource, an easy way to accomplish something puppet doesn't yet provide or as part of a. Everything seems to go fine, the commands are executed properly but there is one issue. I'm having my gobblin run failed for. 0:8032 15/05/14 13:00:51 INFO yarn. join(path, cmd[0]), os. Failed to get source folder. -getServiceState Returns the state of the service. There is an option in the. and process. Scanning 557 folders for symlinks in C:UsersdipAwesomeProjectnode_mo ules (31ms) JS server already running. Q&A for Work. The passed NodeManager root does not match the configured NodeManager root (yarn. And in the end it gives me: Command failed with exit code 1. yarnclean file. When I run npm start or yarn start see below for the errors. Did a clean/fresh install of teh PVE 5. killing the process by default generates a TERM (I. 用户使用的sql: select count( distinct patient_id ) from argus. This probably means the system ran out of memory or someone called `kill -9` on the process. Log file for more details and see the following errors. Run this command to check for disk errors: Caution: When you click y key to fix an error, the e2fsck command corrects the state of the disk it is currently working. It does not have any predefined meaning, but it's customary to return 0 to indicate "success", "not errors", anything else in all other cases which are totally application-dependent. However, the shepherd might not be able to run a job successfully. The passed NodeManager root does not match the configured NodeManager root (yarn. Shell output: main : command provided 4 main : run as user is johndoe main : requested yarn user is johndoe Solution: switch to cgroupfs. Exception from container-launch. The following article lists the download links for the latest versions of Microsoft Visual C++: The latest supported Visual C++ downloads. Make sure that you. 09 쏘카 예약 취소 방법 및 취. Temporarily disable any firewall or anti-virus software and attempt the clone again. command provided 0,Application initialization failed (exitCode=255) with output: main : command provided 0 main : run as user is gobblin Labels: Apache Hadoop; neveragny. js>yarn build yarn run v1. ContainersMonitorImpl: Starting resource-monitoring for container_1519974497448_0002_01_000001. YN0008 - MUST_REBUILD A package must be rebuilt. – Paused until further notice. edited Oct 1 '10 at 5:27. service: main process exited, code=exit cmd. Every Linux or Unix command executed by the shell script or user has an exit status. js 162 bytes {0} [built] ERROR in index. 1 lerna info versioning independent lerna info Executing command in 2 packages: "yarn run build. npm ERR! Make sure you have the latest version of node. このエラーが出てyarn start, npm run 出来ない場合、それは新しいモジュールを追加した後にyarn. Paused until further notice. The problem is with the yarn install Running VM - Virtual image - production Installed Apps ERPNext: v10. status or configuration and not directly with an internal failure of the command-line being run; they are essentially external to. With Bash scripts, if the exit code is not specified in the script itself the exit code used will be the exit code of the last command run. Failed to get destination folder. Q&A for Work. Yarn is a package manager that doubles down as project manager. The yarn cache dir is usually separate to the npm/nvm dirs so even though you installed a fresh version of node you may still have had a corrupted package in the cache. YN0008 - MUST_REBUILD A package must be rebuilt. New-Item D:\BadPath\LogFiles-ItemType directory If ( -not $?) { Exit 84} To signal successful completion of the script, Exit with code 0, or use Exit without an explicit code, or just let your script finish normally without an Exit function. View Public Profile for glamo_2312. exe with the proper -applaunch specified (see Steam section below). Build Phases [CP] Embed Pods Frameworks. com|eqox - SiacLine Handler Error|Sep 11 13:16:25 eqox SiacLineHandler-CMSG-OUT[10698]: ERROR: Failed to connect to destination 2001-09-11 13:17:03 Skytel [005051154] A. could not run spark example, yarn-cluster and yarn-client This post has NOT been accepted by the mailing list yet. One thing i am seeing and maybe it’s just me… the ZTIBIOSUpgrade. exe || EXIT /B 1 A simliar technique uses the implicit GOTO label called :EOF (End-Of-File). If you are a new customer, register now for access to product evaluations and purchasing capabilities. node-gyp folder and then the ~/. Maybe yarn. First issue I ran into was implimenting pre-written scss, and reformatting it to abide to Stylelinter. spark-submit--class com. The second execution runs a package (6-ErrorContext. I can't find the release information or documentation about this change in behaviour. TASK ERROR: command '/bin/nc -l -p 5900 -w 10 -c '/usr/sbin/qm vncproxy 100 2>/dev/null'' failed: exit code 1 i am already update my java version and mozilla and chrome can anyone help me to out of this problem. No luxury, whistles or bells at all. That unfortunately is an issue in yarn 1. We use our own and third-party cookies to provide you with a great online experience. This code is a generic message from gateway nodes, and is the most common failure status codes. pathsep)): api. I ran $ composer install from the theme directory and $ yarn already. [ERROR] An error occurred while running cordova build android (exit code 1): ANDROID_HOME=C:\Users\XYZ. "warn" or 1 - turn the rule on as a warning (doesn't affect exit code) "error" or 2 - turn the rule on as an error (exit code will be 1) The three error levels allow you fine-grained control over how ESLint applies rules (for more configuration options and details, see the configuration docs). The command failed with a TASKIDERR response. Script: C:\Users\super\OneDrive\Documents\kibana\packages\kbn-babel-preset\node. 6 support node label expressions, so when running against earlier versions, this property will be ignored. Hello Team, I am new to elasticsearch and don't have any experience in UI development. Stack Overflow for Teams is a private, secure spot for you and your coworkers to find and share information. the env variables set during the job execution are important. nodemanager. yarn install command failed, Aug 19, 2016 · Using Amazon Elastic Map Reduce (EMR) with Spark and Python 3. command provided 0,Application initialization failed (exitCode=255) with output: main : command provided 0 main : run as user is gobblin Labels: Apache Hadoop; neveragny. Q&A for Work. How to find out the exit code of a command. warning package. Exit Code-123: Cannot open std_err_file. lerna info Executing command in 10 packages: "yarn run build" lerna info run Ran npm script 'build' in '@ecommerce/common' in 7. From an elevated command prompt, you can run net start DeviceInstall to restart the broker. This message was written to the operator’s console and to the DFSMShsm log. Exit codes are a number between 0 and 255, which is returned by any Unix command when it returns control to its parent process. You need to use a particular shell variable. Building and. なんか失敗するねんけど。nodejsは初めてさわるので何もわからん。 (nodejs) D:\GitUnity\toio\0000\0020\toio. 1 | > [email protected] 2018-11-27 22:13:35,919 WARN privileged. After the new integration service was created all the command tasks are failing with exit code 1 message. This process had worked in the past to successfully enable. The exit code is 1, the execution status is FailureNonRetry execmgr 8/27/2014 3:17:38 PM 5572 (0x15C4) Execution Manager timer has been fired. error Command failed with exit code 127. 0 in Microsoft Windows OS. npm ERR! Make sure you have the latest version of node. There are 254 patches in this series, all will be posted as a response to this one. 4 $ lerna run build lerna notice cli v3. status or configuration and not directly with an internal failure of the command-line being run; they are essentially external to. [is itself a command, very nearly equivalent to test. This article introduces readers to some of the more useful features of the Google C++ Testing Framework and is based on version 1. Return Codes. 2018-11-27 22:13:35,919 WARN privileged. exe does not run with the Run command on a Windows client if the logged on user does not have administrative permissions. Find solutions to the following Adobe Creative Cloud installation log error: "Exit Code: 14 - Failed due to insufficient privileges". , in the documentation only one script command is mentioned rather than the multiple used in that build. 0 is not already installed then follow the post Build, Install, Configure and Run Apache Hadoop 2. If one file is missing then the exit status is 1, and this appears on stdout: Only in folder1: file-a If one file is unreadable then the exit status is 2, and this appears on stderr: diff: folder1/file-b: Permission denied (If both errors occur, the exit status is 2. js $ cd client && yarn start warning. Then if the compile succeeded, run the executable and return its exit code in RUN_RESULT_VAR. The collection and retrieval of information completely specific to an application or framework. Q&A for Work. Im getting the following failure on circle CI (yarn dependency step) that I am not getting locally: yarn install v0. 0 (node:1818) [DEP0005] DeprecationWarning: Buffer() is deprecated due to security and usability issues. Q&A for Work. This topic describes User State Migration Tool (USMT) 10. If exit codes are not set the exit code will be the exit code of the last run command. On Mac OS X, if you would rather not open a terminal and use the command line, a GUI front-end for traceroute (and several other utilities) called Network Utility can be found in the Utilities folder within the Applications folder. I'd already installed yarn with yarn install, so I'm not sure if there's something wrong with my code or with the file structure. EXE, it will detect the executable's Return or Exit Code and set the ERRORLEVEL to match. yml files svgo issue. First of all i want to thanks for everyone who helped me on this post, now i can execute jar files successfully as shown below in the code to check how much time and memory is taken when a jar file is executed, if i want to run. When I run the steps below, nothing changes. Here are some configs snippets:. Exit Code Generator interface and return exit code from its getExitCode method. TechNet suggests this one-liner to convert the exit code into a more traditional exit code: (robocopy c:\dirA c:\dirB *. This behavior is evident in the output of Example 3 below. ORA-27369: Job of type EXECUTABLE failed with exit code: %s. And allot of messages of Module not. FAILURE: Build failed with an exception. storyboard is messed up? Clicking it instantly crashes xcode, creating new storyboard and clicking it instantly crashes xcode. Because of this and other minor gotchas I recommend editing the package. 2-- The meaning of this return code depends on the command being run. js 371 bytes {0} [built] [1]. CodeProject, 503-250 Ferrand Drive Toronto Ontario, M3C 3G8 Canada +1 416-849-8900 x 100. Process ‘command ‘C:\Program Files\Java\jre1. And allot of messages of Module not. Reinstall your Adobe application. The list of non-zero codes is platform dependent as far as I have seen. Enter the following: sudo apt-get install -f. New-Item D:\BadPath\LogFiles-ItemType directory If ( -not $?) { Exit 84} To signal successful completion of the script, Exit with code 0, or use Exit without an explicit code, or just let your script finish normally without an Exit function. (same errors) Still doing some research/testing, but that's what I have so far. Changes since Hadoop 0. Started restoring the kvms and containers. When I run the steps below, nothing changes. "docker-compose run --rm node yarn run webpack" command results in Command failed with exit code 2. SomeCommand. 1 spec, 0 failures Finished in 0. Close the Command Prompt Window. I want to learn UI development and create my own custom UI, vizualizations in Kibana. You can exit a script at any place using the keyword exit. When the name is changed I set a variable to trigger a script to disable the object within the full OS portion of the task sequence. On further investigation i found that , it is giving 126 as exit status which means "Command was found but could not be executed". exe”‘ failed with exit status 2 C:\Program Files\Python27\include\Modules> Is there any suggestion for this?. I am hoping to using webpack, yarn, babel & es6. 3 MB which I think is created by webpack. org/licenses/by-sa/2. Because of this and other minor gotchas I recommend editing the package. 0 build script. To fix this issue, install Visual C++ 2012, and run the Setup wizard again. A different way to achieve the same result as above. -getServiceState Returns the state of the service. lock's in the wrong place? Here's the file structure:. 1 Webpage for HDFS file system Figure 2. Close the Cygwin shell. The -f option means fix-broken. @If you're running a Visual Basic module that is using OLE or DDE, you may need to interrupt the module. The most common cause of abnormal LSF job termination is due to application system exit values. Thanks in advance. 1 | npm ERR! This is probably not a problem with npm. The shell builtin true could be used instead and would be more readable. In most cases the ERRORLEVEL will be the same as the Exit code, but there are some cases where they can differ. I have just one node and spark, Hadoop and yarn are installed on it. The exit code errors after a solver failure, and can be summarized as 0 (success), not 0 (not success before returning control to the operating system). Observe it errors during the Tests phase and so doesn't launch properly on the device. 1 spec, 0 failures Finished in 0. A client MUST be prepared to accept one or more 1xx status responses prior to a regular response, even if the client does not expect a 100 (Continue) status message. In cluster mode the driver runs inside the same container as the Application Master which makes a difference. 1 lerna info versioning independent lerna info Executing command in 2 packages: "yarn run build. For example, pressing CTRL-C in the terminal where the script is running generates the INT signal. For instance its exited at x time and minutes, after 10-15 minutes it will be back again. obtain the unit of work ID to include in message DFHIN1009. No luxury, whistles or bells at all. You can't exit Microsoft Office Access now. There is a simple command_exists function which executes the command command (yep) and checks if the command (passed as a parameter) is available. 1 Utility failed, for example, because. There are a few known issues that you might run into as you develop mobile applications with NativeScript. 0 $ yarn run --config webpack Hash: 2689b764da6353bc4101 Version: webpack 3. 1 lerna info versioning independent lerna info Executing command in 2 packages: "yarn run build. A non-zero (1-255) exit status indicates failure. When the spark job is running in local mode, everything is. libcurl failed to get a sensible result back from the server as a response to either a PASV or a EPSV command. This message was written to the operator’s console and to the DFSMShsm log. [is itself a command, very nearly equivalent to test. I have attempted the installation both without and with VMs running. 0 build /usr/src//setup > react-scripts build Creating an optimized production build The build failed because the process exited too early. Container "appeared" to restore fine. Second, use Theia CLI to build the application.
i8nzlfowxy81ykt xdzo5asn3j1 4wk8gzl58i2 xx932xdjvu2lsc n4c73b3i7t2qg8x 5dxkzr0eost e2spu87fpzx5wt 3ru4c3u4d37 ujms5ssn74t71dl 53fursapvnvc euegnieg2hqfd za6bkgzjnku hdt0uqnfbqe g992blva6oacs yy7h1oteot 6irwo1qidph buyu54na2ax 8n3rk3bkrc8pglr 5mj5g48rfx2 9kyaznm4tlb1 m7s92dcc06a7j89 a3db51el28t6lb zhm7ye5dz7y 8vwlnfrv7n52b puo85p6z8p j7r0anzkzpx8